Target
Alpha-2A adrenergic receptor
Ligand
BDBM50146505
Substrate
Meas. Tech.
ChEBML_33077
Ki
2.9±n/a nM
Citation
 Pastor, JAlcázar, JAlvarez, RMAndrés, JICid, JMDe Lucas, AIDíaz, AFernández, JFont, LMIturrino, LLafuente, CMartínez, SBakker, MHBiesmans, IHeylen, LIMegens, AA Synthesis of 3a,4-dihydro-3H-[1]benzopyrano[4,3-c]isoxazoles, displaying combined 5-HT uptake inhibiting and alpha2-adrenoceptor antagonistic activities. Part 2: Further exploration on the cinnamyl moiety. Bioorg Med Chem Lett 14:2917-22 (2004)  
Target
Name:
Alpha-2A adrenergic receptor
Synonyms:
ADA2A_HUMAN ADRA2R Adrenergic alpha2A Alpha-2 adrenergic receptor subtype C10 Alpha-2A adrenoreceptor alpha-2A adrenergic receptor [Homo sapiens]
Type:
Enzyme
Mol. Mass.:
48979.91
Organism:
Homo sapiens (Human)
Description:
P08913
Residue:
450
  
Inhibitor
Name:
BDBM50146505
Synonyms:
(3R,3aS)-3-{4-[3-(2-Fluoro-phenyl)-allyl]-piperazin-1-ylmethyl}-7,8-dimethoxy-3a,4-dihydro-3H-chromeno[4,3-c]isoxazole | CHEMBL319573
Type:
Small organic molecule
Emp. Form.:
C26H30FN3O4
Mol. Mass.:
467.5325
SMILES:
COc1cc2OC[C@H]3[C@H](CN4CCN(C\C=C\c5ccccc5F)CC4)ON=C3c2cc1OC
: