Target
Dipeptidyl peptidase 2
Ligand
BDBM50146949
Substrate
Meas. Tech.
ChEMBL_53368 (CHEMBL666614)
IC50
113±n/a nM
Citation
 Senten, KVan Der Veken, PDe Meester, ILambeir, AMScharpé, SHaemers, AAugustyns, K Gamma-amino-substituted analogues of 1-[(S)-2,4-diaminobutanoyl]piperidine as highly potent and selective dipeptidyl peptidase II inhibitors. J Med Chem 47:2906-16 (2004)  
Target
Name:
Dipeptidyl peptidase 2
Synonyms:
DAP II DPP2_HUMAN Dipeptidyl aminopeptidase II Dipeptidyl peptidase 2 (DPP2) Dipeptidyl peptidase II (DPP II) Dipeptidyl peptidase II and dipeptidyl peptidase IV (DPP2 and DPP4) carboxytripeptidase dipeptidyl(amino)peptidase II | dipeptidylarylamidase
Type:
Protein
Mol. Mass.:
54339.29
Organism:
Homo sapiens (Human)
Description:
Q9UHL4
Residue:
492
  
Inhibitor
Name:
BDBM50146949
Synonyms:
2-(S)-Amino-4-(4-chloro-benzylamino)-1-(4-hydroxy-piperidin-1-yl)-butan-1-one | CHEMBL415317
Type:
Small organic molecule
Emp. Form.:
C16H24ClN3O2
Mol. Mass.:
325.834
SMILES:
N[C@@H](CCNCc1ccc(Cl)cc1)C(=O)N1CCC(O)CC1
: