Target
Transient receptor potential cation channel subfamily V member 1
Ligand
BDBM20334
Substrate
Meas. Tech.
ChEMBL_215802 (CHEMBL820091)
IC50
3±n/a nM
Citation
 Jetter, MCYoungman, MAMcNally, JJZhang, SPDubin, AENasser, NDax, SL N-isoquinolin-5-yl-N'-aralkyl-urea and -amide antagonists of human vanilloid receptor 1. Bioorg Med Chem Lett 14:3053-6 (2004)  
Target
Name:
Transient receptor potential cation channel subfamily V member 1
Synonyms:
Capsaicin receptor Osm-9-like TRP channel 1 TRPV1_HUMAN Transient receptor potential cation channel subfamily V member 1 (TRPV1) Transient receptor potential cation channel subfamily V member 1(TRPV1) Vanilloid VR1 Vanilloid receptor 1 Vanilloid receptor 1 (VRI/TRPV1)
Type:
Protein
Mol. Mass.:
94960.75
Organism:
Homo sapiens (Human)
Description:
Q8NER1
Residue:
839
  
Inhibitor
Name:
BDBM20334
Synonyms:
1-Isoquinolin-5-yl-3-(4-trifluoromethyl-benzyl)-urea A-425619 JMC48744 Compound 14a
Type:
Small organic molecule
Emp. Form.:
C18H14F3N3O
Mol. Mass.:
345.3185
SMILES:
FC(F)(F)c1ccc(CNC(=O)Nc2cccc3cnccc23)cc1
: