Target
Metabotropic glutamate receptor 2
Ligand
BDBM50147143
Substrate
Meas. Tech.
ChEBML_105897
EC50
14±n/a nM
Citation
 Barda, DAWang, ZQBritton, TCHenry, SSJagdmann, GEColeman, DSJohnson, MPAndis, SLSchoepp, DD SAR study of a subtype selective allosteric potentiator of metabotropic glutamate 2 receptor, N-(4-phenoxyphenyl)-N-(3-pyridinylmethyl)ethanesulfonamide. Bioorg Med Chem Lett 14:3099-102 (2004)  
Target
Name:
Metabotropic glutamate receptor 2
Synonyms:
GPRC1B GRM2_HUMAN Metabotropic glutamate receptor mGlu2 | metabotropic glutamate 2
Type:
Enzyme
Mol. Mass.:
95584.88
Organism:
Homo sapiens (Human)
Description:
Q14416
Residue:
872
  
Inhibitor
Name:
BDBM50147143
Synonyms:
2,2,2-Trifluoro-ethanesulfonic acid [3-(1-methyl-butoxy)-phenyl]-pyridin-3-ylmethyl-amide CHEMBL105296
Type:
Small organic molecule
Emp. Form.:
C19H23F3N2O3S
Mol. Mass.:
416.458
SMILES:
CCCC(C)Oc1cccc(c1)N(Cc1cccnc1)S(=O)(=O)CC(F)(F)F
: