Target
Metabotropic glutamate receptor 2
Ligand
BDBM50147150
Substrate
Meas. Tech.
ChEBML_105897
EC50
36±n/a nM
Citation
 Barda, DAWang, ZQBritton, TCHenry, SSJagdmann, GEColeman, DSJohnson, MPAndis, SLSchoepp, DD SAR study of a subtype selective allosteric potentiator of metabotropic glutamate 2 receptor, N-(4-phenoxyphenyl)-N-(3-pyridinylmethyl)ethanesulfonamide. Bioorg Med Chem Lett 14:3099-102 (2004)  
Target
Name:
Metabotropic glutamate receptor 2
Synonyms:
GPRC1B GRM2_HUMAN Metabotropic glutamate receptor mGlu2 | metabotropic glutamate 2
Type:
Enzyme
Mol. Mass.:
95584.88
Organism:
Homo sapiens (Human)
Description:
Q14416
Residue:
872
  
Inhibitor
Name:
BDBM50147150
Synonyms:
2,2,2-Trifluoro-ethanesulfonic acid (3-cyclobutoxy-phenyl)-pyridin-3-ylmethyl-amide | CHEMBL105151
Type:
Small organic molecule
Emp. Form.:
C18H19F3N2O3S
Mol. Mass.:
400.415
SMILES:
FC(F)(F)CS(=O)(=O)N(Cc1cccnc1)c1cccc(OC2CCC2)c1
: