Target
Plasminogen
Ligand
BDBM50147412
Substrate
Meas. Tech.
ChEMBL_155249 (CHEMBL764738)
Ki
68000±n/a nM
Citation
 Barber, CGDickinson, RPFish, PV Selective urokinase-type plasminogen activator (uPA) inhibitors. Part 3: 1-isoquinolinylguanidines. Bioorg Med Chem Lett 14:3227-30 (2004)  
Target
Name:
Plasminogen
Synonyms:
Activation peptide PLG Plasmin Plasmin heavy chain A, short form | Plasmin light chain B
Type:
Enzyme
Mol. Mass.:
90579.18
Organism:
Homo sapiens (Human)
Description:
Residue:
810
  
Inhibitor
Name:
BDBM50147412
Synonyms:
CHEMBL321822 | N-Isoquinolin-1-yl-guanidine
Type:
Small organic molecule
Emp. Form.:
C10H10N4
Mol. Mass.:
186.2132
SMILES:
[#7]\[#6](-[#7])=[#7]/c1nccc2ccccc12
: