Target
Glycogen synthase kinase-3 beta
Ligand
BDBM50147458
Substrate
Meas. Tech.
ChEMBL_79695 (CHEMBL691714)
EC50
40±n/a nM
Citation
 Zhang, HCYe, HConway, BRDerian, CKAddo, MFKuo, GHHecker, LRCroll, DRLi, JWestover, LXu, JZLook, RDemarest, KTAndrade-Gordon, PDamiano, BPMaryanoff, BE 3-(7-Azaindolyl)-4-arylmaleimides as potent, selective inhibitors of glycogen synthase kinase-3. Bioorg Med Chem Lett 14:3245-50 (2004)  
Target
Name:
Glycogen synthase kinase-3 beta
Synonyms:
GSK-3 beta GSK3B Glycogen synthase kinase 3 beta (GSK3B) Glycogen synthase kinase-3 beta (GSK-3B) Glycogen synthase kinase-3 beta (GSK3B) Glycogen synthase kinase-3beta (GSK3B) | Serine/threonine-protein kinase GSK3B
Type:
Enzyme
Mol. Mass.:
46756.38
Organism:
Homo sapiens (Human)
Description:
P49841
Residue:
420
  
Inhibitor
Name:
BDBM50147458
Synonyms:
(3-{3-[4-(2-Methoxy-phenyl)-2,5-dioxo-2,5-dihydro-1H-pyrrol-3-yl]-pyrrolo[2,3-b]pyridin-1-yl}-propyl)-carbamic acid tert-butyl ester | CHEMBL109981
Type:
Small organic molecule
Emp. Form.:
C26H28N4O5
Mol. Mass.:
476.5243
SMILES:
COc1ccccc1C1=C(C(=O)NC1=O)c1cn(CCCNC(=O)OC(C)(C)C)c2ncccc12
: