Target
Dynamin-1
Ligand
BDBM50147559
Substrate
Meas. Tech.
ChEMBL_60874 (CHEMBL673521)
IC50
8740±n/a nM
Citation
 Hill, TAOdell, LRQuan, AAbagyan, RFerguson, GRobinson, PJMcCluskey, A Long chain amines and long chain ammonium salts as novel inhibitors of dynamin GTPase activity. Bioorg Med Chem Lett 14:3275-8 (2004)  
Target
Name:
Dynamin-1
Synonyms:
DNM DYN1_HUMAN | Dynamin-1
Type:
PROTEIN
Mol. Mass.:
97411.67
Organism:
Homo sapiens (Human)
Description:
ChEMBL_1458576
Residue:
864
  
Inhibitor
Name:
BDBM50147559
Synonyms:
CHEMBL110310 Tetradecyl-ammonium; bromide
Type:
Small organic molecule
Emp. Form.:
C14H32N
Mol. Mass.:
214.41
SMILES:
CCCCCCCCCCCCCC[NH3+]
: