Target
72 kDa type IV collagenase
Ligand
BDBM50241372
Substrate
Meas. Tech.
ChEMBL_104408 (CHEMBL715011)
Ki
3000±n/a nM
Citation
 Rizzo, RCToba, SKuntz, ID A molecular basis for the selectivity of thiadiazole urea inhibitors with stromelysin-1 and gelatinase-A from generalized born molecular dynamics simulations. J Med Chem 47:3065-74 (2004)  
Target
Name:
72 kDa type IV collagenase
Synonyms:
72 kDa gelatinase CLG4A Gelatinase A (MMP-2) MMP2_HUMAN Matrix metalloproteinase-2 (MMP 2) Matrix metalloproteinases 2 (MMP-2) | TBE-1
Type:
Enzyme
Mol. Mass.:
73870.36
Organism:
Homo sapiens (Human)
Description:
P08253
Residue:
660
  
Inhibitor
Name:
BDBM50241372
Synonyms:
(S)-1-(1-(methylamino)-1-oxo-3-phenylpropan-2-yl)-3-(5-thioxo-4,5-dihydro-1,3,4-thiadiazol-2-yl)urea 2-[3-(5-MERCAPTO-[1,3,4]THIADIAZOL-2-YL)-UREIDO]-N-METHYL-3-PHENYL-PROPIONAMIDE PNU-107859
Type:
Small organic molecule
Emp. Form.:
C13H15N5O2S2
Mol. Mass.:
337.421
SMILES:
CNC(=O)[C@H](Cc1ccccc1)NC(=O)Nc1nnc(S)s1
: