Target
Nitric oxide synthase, endothelial
Ligand
BDBM50091817
Substrate
Meas. Tech.
ChEMBL_65303 (CHEMBL678077)
IC50
50±n/a nM
Citation
 Connolly, SAberg, AArvai, ABeaton, HGCheshire, DRCook, ARCooper, SCox, DHamley, PMallinder, PMillichip, INicholls, DJRosenfeld, RJSt-Gallay, SATainer, JTinker, ACWallace, AV 2-aminopyridines as highly selective inducible nitric oxide synthase inhibitors. Differential binding modes dependent on nitrogen substitution. J Med Chem 47:3320-3 (2004)  
Target
Name:
Nitric oxide synthase, endothelial
Synonyms:
Constitutive NOS Endothelial NOS NOS type III NOS3_HUMAN Nitric oxide synthase (inducible and endothelial) Nitric-oxide synthase (endothelial and brain) eNOS
Type:
Enzyme Catalytic Domain
Mol. Mass.:
133297.84
Organism:
Homo sapiens (Human)
Description:
P29474
Residue:
1203
  
Inhibitor
Name:
BDBM50091817
Synonyms:
4-Methyl-6-propyl-pyridin-2-ylamine 4-methyl-6-propylpyridin-2-amine | CHEMBL302657
Type:
Small organic molecule
Emp. Form.:
C9H14N2
Mol. Mass.:
150.2209
SMILES:
CCCc1cc(C)cc(N)n1
: