Target
Tissue-type plasminogen activator
Ligand
BDBM50148365
Substrate
Meas. Tech.
ChEMBL_208052 (CHEMBL812494)
IC50
390±n/a nM
Citation
 Gopalsamy, AKincaid, SLEllingboe, JWGroeling, TMAntrilli, TMKrishnamurthy, GAulabaugh, AFriedrichs, GSCrandall, DL Design and synthesis of oxadiazolidinediones as inhibitors of plasminogen activator inhibitor-1. Bioorg Med Chem Lett 14:3477-80 (2004)  
Target
Name:
Tissue-type plasminogen activator
Synonyms:
Alteplase Reteplase Thrombin receptor protein Tissue-type plasminogen activator (tPA) t-PA t-plasminogen activator
Type:
Enzyme
Mol. Mass.:
62931.08
Organism:
Homo sapiens (Human)
Description:
Residue:
562
  
Inhibitor
Name:
BDBM50148365
Synonyms:
2-{3-[4-(3,5-Bis-trifluoromethyl-benzyloxy)-phenyl]-1-phenyl-propyl}-[1,2,4]oxadiazolidine-3,5-dione | CHEMBL116137
Type:
Small organic molecule
Emp. Form.:
C26H20F6N2O4
Mol. Mass.:
538.4384
SMILES:
FC(F)(F)c1cc(COc2ccc(CCC(c3ccccc3)n3oc(=O)[nH]c3=O)cc2)cc(c1)C(F)(F)F
: