Target
Sphingosine 1-phosphate receptor 2
Ligand
BDBM50148425
Substrate
Meas. Tech.
ChEBML_201324
IC50
4700±n/a nM
Citation
 Hale, JJDoherty, GToth, LMills, SGHajdu, RKeohane, CARosenbach, MMilligan, JShei, GJChrebet, GBergstrom, JCard, DForrest, MSun, SYWest, SXie, HNomura, NRosen, HMandala, S Selecting against S1P3 enhances the acute cardiovascular tolerability of 3-(N-benzyl)aminopropylphosphonic acid S1P receptor agonists. Bioorg Med Chem Lett 14:3501-5 (2004)  
Target
Name:
Sphingosine 1-phosphate receptor 2
Synonyms:
EDG5 S1PR2 Sphingosine 1-phosphate receptor Sphingosine-1-phosphate receptor 2 | ndothelial differentiation G-protein coupled receptor 5
Type:
G Protein-Coupled Receptor (GPCR)
Mol. Mass.:
38883.16
Organism:
Homo sapiens (Human)
Description:
Membranes isolated from S1P2-transfected CHO cells were used in ligand binding assay.
Residue:
353
  
Inhibitor
Name:
BDBM50148425
Synonyms:
CHEMBL119873 | [3-(3-Fluoro-4-octyloxy-benzylamino)-propyl]-phosphonic acid
Type:
Small organic molecule
Emp. Form.:
C18H31FNO4P
Mol. Mass.:
375.4152
SMILES:
CCCCCCCCOc1ccc(CNCCCP(O)(O)=O)cc1F
: