Target
Epidermal growth factor receptor/Receptor tyrosine-protein kinase erbB-2
Ligand
BDBM50404281
Substrate
Meas. Tech.
ChEMBL_78744 (CHEMBL689293)
IC50
280±n/a nM
Citation
 Revesz, LBlum, EDi Padova, FEBuhl, TFeifel, RGram, HHiestand, PManning, URucklin, G Novel p38 inhibitors with potent oral efficacy in several models of rheumatoid arthritis. Bioorg Med Chem Lett 14:3595-9 (2004)  
Target
Name:
Epidermal growth factor receptor/Receptor tyrosine-protein kinase erbB-2
Synonyms:
Epidermal growth factor receptor and ErbB2 (HER1 and HER2)
Type:
Mol. Mass.:
Description:
ASSAY_ID of ChEMBL is 48729
Components:
This complex has 2 components.
Component 1
Name:
Epidermal growth factor receptor
Synonyms:
EGF Receptor Substrate EGFR_HUMAN ERBB1 Epidermal Growth Factor Receptor erbB-1 Epidermal growth factor receptor (EGFR) HER1 Proto-oncogene c-ErbB-1 Tyrosine-Protein Kinase ErbB-1
Type:
Receptor Kinase Domain
Mol. Mass.:
134279.59
Organism:
Homo sapiens (Human)
Description:
P00533
Residue:
1210
  
Component 2
Name:
Receptor tyrosine-protein kinase erbB-2
Synonyms:
2.7.10.1 CD_antigen=CD340 ERBB2_HUMAN FASN/HER2 HER2 MLN19 NEU Proto-oncogene Neu Tyrosine kinase-type cell surface receptor HER2 | p185erbB2
Type:
Mol. Mass.:
137894.47
Organism:
Homo sapiens (Human)
Description:
P04626
Residue:
1255
  
Inhibitor
Name:
BDBM50404281
Synonyms:
CHEMBL2111784
Type:
Small organic molecule
Emp. Form.:
C28H29FN4S
Mol. Mass.:
472.62
SMILES:
C[C@H](Nc1cc(ccn1)-c1sc(nc1-c1ccc(F)cc1)C1CCN(C)CC1)c1ccccc1
: