Target
Adenosine receptor A2a
Ligand
BDBM50149135
Substrate
Meas. Tech.
ChEBML_31209
IC50
>650±n/a nM
Citation
 Okamura, TKurogi, YHashimoto, KSato, SNishikawa, HKiryu, KNagao, Y Structure-activity relationships of adenosine A3 receptor ligands: new potential therapy for the treatment of glaucoma. Bioorg Med Chem Lett 14:3775-9 (2004)  
Target
Name:
Adenosine receptor A2a
Synonyms:
A2A adenosine receptor (hA2A) ADENOSINE A2 ADORA2 Adenosine A2A receptor (A2AAR)
Type:
G Protein-Coupled Receptor (GPCR)
Mol. Mass.:
44716.46
Organism:
Homo sapiens (Human)
Description:
P29274
Residue:
412
  
Inhibitor
Name:
BDBM50149135
Synonyms:
5-Butyl-2-furan-2-yl-[1,2,4]triazolo[1,5-c]quinazoline | CHEMBL122230
Type:
Small organic molecule
Emp. Form.:
C17H16N4O
Mol. Mass.:
292.3351
SMILES:
CCCCc1nc2ccccc2c2nc(nn12)-c1ccco1
: