Target
Gamma-aminobutyric acid receptor subunit alpha-6/beta-3/gamma-2
Ligand
BDBM50144861
Substrate
Meas. Tech.
ChEMBL_70712 (CHEMBL685348)
Ki
4410±n/a nM
Citation
 Street, LJSternfeld, FJelley, RAReeve, AJCarling, RWMoore, KWMcKernan, RMSohal, BCook, SPike, ADawson, GRBromidge, FAWafford, KASeabrook, GRThompson, SAMarshall, GPillai, GVCastro, JLAtack, JRMacLeod, AM Synthesis and biological evaluation of 3-heterocyclyl-7,8,9,10-tetrahydro-(7,10-ethano)-1,2,4-triazolo[3,4-a]phthalazines and analogues as subtype-selective inverse agonists for the GABA(A)alpha5 benzodiazepine binding site. J Med Chem 47:3642-57 (2004)  
Target
Name:
Gamma-aminobutyric acid receptor subunit alpha-6/beta-3/gamma-2
Synonyms:
GABA receptor alpha-6/beta-3/gamma-2 subunit | GABA-A receptor; alpha-6/beta-3/gamma-2
Type:
Mol. Mass.:
Description:
ASSAY_ID of EBI is 68432
Components:
This complex has 3 components.
Component 1
Name:
Gamma-aminobutyric acid receptor subunit gamma-2
Synonyms:
GABA(A) receptor subunit gamma-2 GBRG2_HUMAN
Type:
PROTEIN
Mol. Mass.:
54172.74
Organism:
Homo sapiens (Human)
Description:
EBI_217
Residue:
467
  
Component 2
Name:
Gamma-aminobutyric acid receptor subunit alpha-6
Synonyms:
GABA A alpha6 GABRA6 | GBRA6_HUMAN
Type:
Enzyme Catalytic Domain
Mol. Mass.:
51029.60
Organism:
Homo sapiens (Human)
Description:
GABA A alpha6 0 HUMAN::Q16445
Residue:
453
  
Component 3
Name:
Gamma-aminobutyric acid receptor subunit beta-3
Synonyms:
GABA A receptor alpha-4/beta-3/gamma-2 GABA-A receptor GBRB3_HUMAN | agonist GABA site
Type:
PROTEIN
Mol. Mass.:
54130.51
Organism:
Homo sapiens (Human)
Description:
ChEMBL_448071
Residue:
473
  
Inhibitor
Name:
BDBM50144861
Synonyms:
3-(5-Methyl-isoxazol-3-yl)-6-(pyridin-2-ylmethoxy)-[1,2,4]triazolo[3,4-a]phthalazine CHEMBL68684
Type:
Small organic molecule
Emp. Form.:
C19H14N6O2
Mol. Mass.:
358.3535
SMILES:
Cc1cc(no1)-c1nnc2c3ccccc3c(OCc3ccccn3)nn12
: