Target
POU domain, class 3, transcription factor 3
Ligand
BDBM50149552
Substrate
Meas. Tech.
ChEMBL_305968 (CHEMBL832954)
IC50
810000±n/a nM
Citation
 Ji, TLee, MPruitt, SCHangauer, DG Privileged scaffolds for blocking protein-protein interactions: 1,4-disubstituted naphthalene antagonists of transcription factor complex HOX-PBX/DNA. Bioorg Med Chem Lett 14:3875-9 (2004)  
Target
Name:
POU domain, class 3, transcription factor 3
Synonyms:
BRN1 OTF8 POU3F3
Type:
PROTEIN
Mol. Mass.:
50342.98
Organism:
Homo sapiens (Human)
Description:
ChEMBL_305968
Residue:
500
  
Inhibitor
Name:
BDBM50149552
Synonyms:
4-Cyclopropylcarbamoylmethoxy-naphthalene-1-carboxylic acid (3-fluoro-phenyl)-amide | CHEMBL182776
Type:
Small organic molecule
Emp. Form.:
C22H19FN2O3
Mol. Mass.:
378.3963
SMILES:
Fc1cccc(NC(=O)c2ccc(OCC(=O)NC3CC3)c3ccccc23)c1
: