Target
Muscarinic acetylcholine receptor M2
Ligand
BDBM50149722
Substrate
Meas. Tech.
ChEMBL_302560 (CHEMBL875217)
Ki
449.0±n/a nM
Citation
 Chackalamannil, SDoller, DMcQuade, RRuperto, V Himbacine analogs as muscarinic receptor antagonists--effects of tether and heterocyclic variations. Bioorg Med Chem Lett 14:3967-70 (2004)  
Target
Name:
Muscarinic acetylcholine receptor M2
Synonyms:
ACM2_HUMAN Cholinergic, muscarinic M2 Muscarinic acetylcholine receptor M2 and M5 | RecName: Full=Muscarinic acetylcholine receptor M2
Type:
GPCR
Mol. Mass.:
51730.61
Organism:
Homo sapiens (Human)
Description:
P08172
Residue:
466
  
Inhibitor
Name:
BDBM50149722
Synonyms:
(3S,3aR,4R,4aS,8aR,9aS)-4-[(S)-1-Hydroxy-2-(1,5,5-trimethyl-pyrrolidin-2-yl)-ethyl]-3-methyl-decahydro-naphtho[2,3-c]furan-1-one | CHEMBL183331
Type:
Small organic molecule
Emp. Form.:
C23H39NO2
Mol. Mass.:
361.5613
SMILES:
CCN1C(CCC2[C@H]3[C@H](C)OC(=O)[C@H]3C[C@H]3CCCC[C@H]23)CCC1(C)C
: