Target
Lysophosphatidic acid receptor 3
Ligand
BDBM50150005
Substrate
Meas. Tech.
ChEMBL_304755 (CHEMBL829353)
Ki
1093±n/a nM
Citation
 Heasley, BHJarosz, RCarter, KMVan, SJLynch, KRMacdonald, TL A novel series of 2-pyridyl-containing compounds as lysophosphatidic acid receptor antagonists: development of a nonhydrolyzable LPA3 receptor-selective antagonist. Bioorg Med Chem Lett 14:4069-74 (2004)  
Target
Name:
Lysophosphatidic acid receptor 3
Synonyms:
EDG7 LPAR3 Lysophosphatidic acid receptor 1/3 Lysophosphatidic acid receptor Edg-7
Type:
Enzyme
Mol. Mass.:
40149.72
Organism:
Homo sapiens (Human)
Description:
Q9UBY5
Residue:
353
  
Inhibitor
Name:
BDBM50150005
Synonyms:
CHEMBL83782 | Phosphoric acid mono-[3-[4-(6-methoxy-pyridin-2-ylmethoxy)-phenyl]-2-((Z)-(S)-octadec-9-enoylamino)-propyl] ester
Type:
Small organic molecule
Emp. Form.:
C34H53N2O7P
Mol. Mass.:
632.7676
SMILES:
CCCCCCCC\C=C/CCCCCCCC(=O)N[C@H](COP(O)(O)=O)Cc1ccc(OCc2cccc(OC)n2)cc1
: