Target
Heat shock protein HSP 90-alpha/90-beta
Ligand
BDBM50150184
Substrate
Meas. Tech.
ChEMBL_84811 (CHEMBL695092)
IC50
15±n/a nM
Citation
 Le Brazidec, JYKamal, ABusch, DThao, LZhang, LTimony, GGrecko, RTrent, KLough, RSalazar, TKhan, SBurrows, FBoehm, MF Synthesis and biological evaluation of a new class of geldanamycin derivatives as potent inhibitors of Hsp90. J Med Chem 47:3865-73 (2004)  
Target
Name:
Heat shock protein HSP 90-alpha/90-beta
Synonyms:
Heat Shock Protein 90 (Hsp90) Heat shock protein HSP90
Type:
Mol. Mass.:
Description:
ASSAY_ID of EBI is 29664
Components:
This complex has 2 components.
Component 1
Name:
Heat shock protein HSP 90-alpha
Synonyms:
HS90A_HUMAN HSP86 HSP90AA1 HSPCA Heat shock 86 kDa Heat shock protein HSP 90-alpha (HSP90) LAP-2 Lipopolysaccharide-associated protein 2 heat shock protein 90kDa alpha (cytosolic), class A member 1 isoform 2
Type:
Molecular Chaperone
Mol. Mass.:
84623.45
Organism:
Homo sapiens (Human)
Description:
P07900
Residue:
732
  
Component 2
Name:
Heat shock protein HSP 90-beta
Synonyms:
HS90B_HUMAN HSP 90 HSP90B HSPCB Heat shock protein HSP 90 (Hsp90)
Type:
Molecular Chaperone
Mol. Mass.:
83229.45
Organism:
Homo sapiens (Human)
Description:
P08238
Residue:
724
  
Inhibitor
Name:
BDBM50150184
Synonyms:
CHEMBL332352 | Carbamic acid (4E,6Z,10E)-(8S,9S,12S,13R,14S,16R)-19-(4-dimethylaminomethyl-benzoylamino)-13-hydroxy-8,14-dimethoxy-4,10,12,16-tetramethyl-3,20,22-trioxo-2-aza-bicyclo[16.3.1]docosa-1(21),4,6,10,18-pentaen-9-yl ester
Type:
Small organic molecule
Emp. Form.:
C38H50N4O9
Mol. Mass.:
706.825
SMILES:
CO[C@H]1CC(C)=Cc2c(O)c(NC(=O)C(C)=CC=C[C@H](OC)[C@@H](OC(N)=O)\C(C)=C\[C@H](C)[C@H]1O)cc(O)c2NC(=O)c1ccc(CN(C)C)cc1
: