Target
Phenylethanolamine N-methyltransferase
Ligand
BDBM50080520
Substrate
Meas. Tech.
ChEMBL_303166 (CHEMBL829978)
Ki
70.0±n/a nM
Citation
 Wu, QCriscione, KRGrunewald, GLMcLeish, MJ Phenylethanolamine N-methyltransferase inhibition: re-evaluation of kinetic data. Bioorg Med Chem Lett 14:4217-20 (2004)  
Target
Name:
Phenylethanolamine N-methyltransferase
Synonyms:
Noradrenaline N-methyltransferase PNMT PNMTase | Phenylethanolamine N-Methyltransferase (PNMT)
Type:
Enzyme
Mol. Mass.:
30852.66
Organism:
Homo sapiens (Human)
Description:
Residue:
282
  
Inhibitor
Name:
BDBM50080520
Synonyms:
3-Fluoromethyl-7-iodo-1,2,3,4-tetrahydro-isoquinoline | CHEMBL275595
Type:
Small organic molecule
Emp. Form.:
C10H11FIN
Mol. Mass.:
291.1039
SMILES:
FCC1Cc2ccc(I)cc2CN1
: