Target
Cathepsin B
Ligand
BDBM50150527
Substrate
Meas. Tech.
ChEMBL_304815 (CHEMBL827904)
IC50
158±n/a nM
Citation
 Robichaud, JBayly, COballa, RPrasit, PMellon, CFalgueyret, JPPercival, MDWesolowski, GRodan, SB Rational design of potent and selective NH-linked aryl/heteroaryl cathepsin K inhibitors. Bioorg Med Chem Lett 14:4291-5 (2004)  
Target
Name:
Cathepsin B
Synonyms:
APP secretase CATB_HUMAN CTSB Cathepsin B light chain | Cathepsin B1
Type:
Enzyme
Mol. Mass.:
37819.69
Organism:
Homo sapiens (Human)
Description:
gi_63102437
Residue:
339
  
Inhibitor
Name:
BDBM50150527
Synonyms:
2-(4-Bromo-thiophen-3-ylamino)-4-methyl-pentanoic acid cyanomethyl-amide | CHEMBL365007
Type:
Small organic molecule
Emp. Form.:
C12H16BrN3OS
Mol. Mass.:
330.244
SMILES:
CC(C)C[C@H](Nc1cscc1Br)C(=O)NCC#N
: