Target
Cathepsin K
Ligand
BDBM19856
Substrate
Meas. Tech.
ChEMBL_304816 (CHEMBL827905)
IC50
3±n/a nM
Citation
 Robichaud, JBayly, COballa, RPrasit, PMellon, CFalgueyret, JPPercival, MDWesolowski, GRodan, SB Rational design of potent and selective NH-linked aryl/heteroaryl cathepsin K inhibitors. Bioorg Med Chem Lett 14:4291-5 (2004)  
Target
Name:
Cathepsin K
Synonyms:
CATK_HUMAN CTSO Cathepsin O Cathepsin X
Type:
Enzyme
Mol. Mass.:
36975.68
Organism:
Homo sapiens (Human)
Description:
P43235
Residue:
329
  
Inhibitor
Name:
BDBM19856
Synonyms:
(2R)-N-(cyanomethyl)-4-methyl-2-{3-[4-(piperazin-1-yl)phenyl]phenyl}pentanamide JMC463709 (R)-2 | piperazine-containing compound, 11
Type:
Small organic molecule
Emp. Form.:
C24H30N4O
Mol. Mass.:
390.5212
SMILES:
CC(C)C[C@@H](C(=O)NCC#N)c1cccc(c1)-c1ccc(cc1)N1CCNCC1
: