Target
Cathepsin K
Ligand
BDBM50150535
Substrate
Meas. Tech.
ChEMBL_305167 (CHEMBL832757)
IC50
433±n/a nM
Citation
 Robichaud, JBayly, COballa, RPrasit, PMellon, CFalgueyret, JPPercival, MDWesolowski, GRodan, SB Rational design of potent and selective NH-linked aryl/heteroaryl cathepsin K inhibitors. Bioorg Med Chem Lett 14:4291-5 (2004)  
Target
Name:
Cathepsin K
Synonyms:
CATK_RABIT | CTSK
Type:
Enzyme
Mol. Mass.:
36879.51
Organism:
Oryctolagus cuniculus (rabbit)
Description:
Residue:
329
  
Inhibitor
Name:
BDBM50150535
Synonyms:
2-(2-Bromo-phenylsulfanyl)-4-methyl-pentanoic acid cyanomethyl-amide | CHEMBL185305
Type:
Small organic molecule
Emp. Form.:
C14H17BrN2OS
Mol. Mass.:
341.267
SMILES:
CC(C)CC(Sc1ccccc1Br)C(=O)NCC#N
: