Target
Procathepsin L
Ligand
BDBM50150532
Substrate
Meas. Tech.
ChEMBL_304817 (CHEMBL827906)
IC50
115±n/a nM
Citation
 Robichaud, JBayly, COballa, RPrasit, PMellon, CFalgueyret, JPPercival, MDWesolowski, GRodan, SB Rational design of potent and selective NH-linked aryl/heteroaryl cathepsin K inhibitors. Bioorg Med Chem Lett 14:4291-5 (2004)  
Target
Name:
Procathepsin L
Synonyms:
CATL1_HUMAN CTSL CTSL1 Cathepsin L Cathepsin L1 heavy chain MEP cathepsin L preproprotein
Type:
Enzyme
Mol. Mass.:
37557.19
Organism:
Homo sapiens (Human)
Description:
Purchased from Calbiochem (San Diego, CA).
Residue:
333
  
Inhibitor
Name:
BDBM50150532
Synonyms:
(S)-4-Methyl-2-(4''-piperazin-1-yl-biphenyl-4-ylamino)-pentanoic acid cyanomethyl-amide | CHEMBL184859
Type:
Small organic molecule
Emp. Form.:
C24H31N5O
Mol. Mass.:
405.5358
SMILES:
CC(C)C[C@H](Nc1ccc(cc1)-c1ccc(cc1)N1CCNCC1)C(=O)NCC#N
: