Target
M-phase inducer phosphatase 1
Ligand
BDBM50087141
Substrate
Meas. Tech.
ChEMBL_305898 (CHEMBL832081)
IC50
17200±n/a nM
Citation
 Shimazawa, RGochomori, MShirai, R Design and synthesis of novel Cdc25A-inhibitors having phosphate group as a hydrophilic residue. Bioorg Med Chem Lett 14:4339-42 (2004)  
Target
Name:
M-phase inducer phosphatase 1
Synonyms:
CDC25A Dual specificity phosphatase Cdc25A MPIP1_HUMAN | phosphatase Cdc25
Type:
Protein
Mol. Mass.:
59090.18
Organism:
Homo sapiens (Human)
Description:
P30304
Residue:
524
  
Inhibitor
Name:
BDBM50087141
Synonyms:
(E)-2-((1R,7aR)-7a-methyl-1-((R)-6-methylheptan-2-yl)-octahydroinden-4-ylidene)acetic acid [(1R,7aR)-1-((R)-1,5-Dimethyl-hexyl)-7a-methyl-octahydro-inden-(4E)-ylidene]-acetic acid
Type:
Small organic molecule
Emp. Form.:
C20H34O2
Mol. Mass.:
306.4828
SMILES:
CC(C)CCC[C@@H](C)[C@H]1CCC2\C(CCC[C@]12C)=C\C(O)=O
: