Target
Melanin-concentrating hormone receptor 1
Ligand
BDBM50150715
Substrate
Meas. Tech.
ChEMBL_306171 (CHEMBL830966)
IC50
5.5±n/a nM
Citation
 Clark, DEHiggs, CWren, SPDyke, HJWong, MNorman, DLockey, PMRoach, AG A virtual screening approach to finding novel and potent antagonists at the melanin-concentrating hormone 1 receptor. J Med Chem 47:3962-71 (2004)  
Target
Name:
Melanin-concentrating hormone receptor 1
Synonyms:
G-protein coupled receptor 24 MCH receptor 1 MCH-R1 MCHR-1 MCHR1_HUMAN Melanin-Concentrating Hormone Receptor 1 (MCH1R) Melanin-concentrating hormone receptor 1 (MCH-1) Melanin-concentrating hormone receptor 1 (MCHR-1) SLC-1 Somatostatin receptor-like protein
Type:
G Protein-Coupled Receptor (GPCR)
Mol. Mass.:
45976.27
Organism:
Homo sapiens (Human)
Description:
Membranes from CHO-K1 cells stably expressing human MCH1R were used in assays.
Residue:
422
  
Inhibitor
Name:
BDBM50150715
Synonyms:
4''-Fluoro-biphenyl-4-carboxylic acid (6-dimethylaminomethyl-5,6,7,8-tetrahydro-naphthalen-2-yl)-amide CHEMBL178707 T-226296
Type:
Small organic molecule
Emp. Form.:
C26H27FN2O
Mol. Mass.:
402.5038
SMILES:
CN(C)CC1CCc2cc(NC(=O)c3ccc(cc3)-c3ccc(F)cc3)ccc2C1
: