Target
Prostaglandin G/H synthase 2
Ligand
BDBM50150720
Substrate
Meas. Tech.
ChEMBL_305178 (CHEMBL832767)
IC50
31600±n/a nM
Citation
 Rao, PNUddin, MJKnaus, EE Design, synthesis, and structure-activity relationship studies of 3,4,6-triphenylpyran-2-ones as selective cyclooxygenase-2 inhibitors. J Med Chem 47:3972-90 (2004)  
Target
Name:
Prostaglandin G/H synthase 2
Synonyms:
COX2 Cyclooxygenase-2 (COX-2) PTGS2 Prostaglandin G/H synthase (cyclooxygenase)
Type:
Protein
Mol. Mass.:
68976.98
Organism:
Ovis aries (Sheep)
Description:
Residue:
603
  
Inhibitor
Name:
BDBM50150720
Synonyms:
4-(4-Fluoro-phenyl)-3-(4-methanesulfonyl-phenyl)-6-(4-methylsulfanyl-phenyl)-pyran-2-one | CHEMBL188933
Type:
Small organic molecule
Emp. Form.:
C25H19FO4S2
Mol. Mass.:
466.544
SMILES:
CSc1ccc(cc1)-c1cc(-c2ccc(F)cc2)c(-c2ccc(cc2)S(C)(=O)=O)c(=O)o1
: