Target
Prostaglandin G/H synthase 2
Ligand
BDBM50150750
Substrate
Meas. Tech.
ChEMBL_305178 (CHEMBL832767)
IC50
450±n/a nM
Citation
 Rao, PNUddin, MJKnaus, EE Design, synthesis, and structure-activity relationship studies of 3,4,6-triphenylpyran-2-ones as selective cyclooxygenase-2 inhibitors. J Med Chem 47:3972-90 (2004)  
Target
Name:
Prostaglandin G/H synthase 2
Synonyms:
COX2 Cyclooxygenase-2 (COX-2) PTGS2 Prostaglandin G/H synthase (cyclooxygenase)
Type:
Protein
Mol. Mass.:
68976.98
Organism:
Ovis aries (Sheep)
Description:
Residue:
603
  
Inhibitor
Name:
BDBM50150750
Synonyms:
4-(4-Methanesulfonyl-phenyl)-6-(4-methoxy-phenyl)-3-phenyl-pyran-2-one | CHEMBL189133
Type:
Small organic molecule
Emp. Form.:
C25H20O5S
Mol. Mass.:
432.488
SMILES:
COc1ccc(cc1)-c1cc(-c2ccc(cc2)S(C)(=O)=O)c(-c2ccccc2)c(=O)o1
: