Target
Peroxisome proliferator-activated receptor alpha
Ligand
BDBM50145710
Substrate
Meas. Tech.
ChEMBL_302950 (CHEMBL841785)
Ki
4±n/a nM
Citation
 Henke, BR Peroxisome proliferator-activated receptor alpha/gamma dual agonists for the treatment of type 2 diabetes. J Med Chem 47:4118-27 (2004)  
Target
Name:
Peroxisome proliferator-activated receptor alpha
Synonyms:
NR1C1 PPAR PPAR-alpha PPARA_HUMAN Peroxisome proliferator-activated receptor | Peroxisome proliferator-activated receptor alpha (PPAR alpha)
Type:
Enzyme
Mol. Mass.:
52222.08
Organism:
Homo sapiens (Human)
Description:
Q07869
Residue:
468
  
Inhibitor
Name:
BDBM50145710
Synonyms:
2-Methyl-3-{4-[2-(5-methyl-2-thiophen-2-yl-oxazol-4-yl)-ethoxy]-phenyl}-2-phenoxy-propionic acid | CHEMBL82602
Type:
Small organic molecule
Emp. Form.:
C26H25NO5S
Mol. Mass.:
463.545
SMILES:
Cc1oc(nc1CCOc1ccc(CC(C)(Oc2ccccc2)C(O)=O)cc1)-c1cccs1
: