Target
Peroxisome proliferator-activated receptor gamma
Ligand
BDBM50109551
Substrate
Meas. Tech.
ChEMBL_304407 (CHEMBL831812)
EC50
570.0±n/a nM
Citation
 Henke, BR Peroxisome proliferator-activated receptor alpha/gamma dual agonists for the treatment of type 2 diabetes. J Med Chem 47:4118-27 (2004)  
Target
Name:
Peroxisome proliferator-activated receptor gamma
Synonyms:
NR1C3 PPAR-gamma PPARG_HUMAN Peroxisome proliferator-activated receptor gamma (PPAR gamma) Peroxisome proliferator-activated receptor gamma (PPARĪ³) peroxisome proliferator-activated receptor gamma isoform 2
Type:
Nuclear Receptor
Mol. Mass.:
57613.46
Organism:
Homo sapiens (Human)
Description:
P37231
Residue:
505
  
Inhibitor
Name:
BDBM50109551
Synonyms:
(2S)-2-ETHOXY-3-{4-[2-(10H-PHENOXAZIN-10-YL)ETHOXY]PHENYL}PROPANOIC ACID 2-Ethoxy-3-[4-(2-phenoxazin-10-yl-ethoxy)-phenyl]-propionic acid CHEMBL24038 | Ragaglitazar
Type:
Small organic molecule
Emp. Form.:
C25H25NO5
Mol. Mass.:
419.4697
SMILES:
CCO[C@@H](Cc1ccc(OCCN2c3ccccc3Oc3ccccc23)cc1)C(O)=O
: