Target
Prostaglandin G/H synthase 2
Ligand
BDBM50151765
Substrate
Meas. Tech.
ChEMBL_306195 (CHEMBL830989)
IC50
110±n/a nM
Citation
 Campbell, JABordunov, VBroka, CABrowner, MFKress, JMMirzadegan, TRamesha, CSanpablo, BFStabler, RTakahara, PVillasenor, AWalker, KAWang, JHWelch, MWeller, P Rational design of 6-methylsulfonylindoles as selective cyclooxygenase-2 inhibitors. Bioorg Med Chem Lett 14:4741-5 (2004)  
Target
Name:
Prostaglandin G/H synthase 2
Synonyms:
COX2 Cyclooxygenase 2 (COX-2) Cyclooxygenase-2 (COX-2 AA) Cyclooxygenase-2 (COX-2) PGH2_HUMAN PHS II Prostaglandin E synthase/G/H synthase 2 Prostaglandin-endoperoxide synthase 2
Type:
Enzyme
Mol. Mass.:
69003.89
Organism:
Homo sapiens (Human)
Description:
Recombinant Cox-2 provided by Cayman (Cayman Chemical Co.,Ann Arbor, MI).
Residue:
604
  
Inhibitor
Name:
BDBM50151765
Synonyms:
3-(2,4-Difluoro-phenoxy)-6-methanesulfonyl-2-methyl-1H-indole | CHEMBL359563
Type:
Small organic molecule
Emp. Form.:
C16H13F2NO3S
Mol. Mass.:
337.341
SMILES:
Cc1[nH]c2cc(ccc2c1Oc1ccc(F)cc1F)S(C)(=O)=O
: