Target
Dipeptidyl peptidase 4
Ligand
BDBM50151803
Substrate
Meas. Tech.
ChEMBL_304966 (CHEMBL827095)
IC50
931.0±n/a nM
Citation
 Xu, JOk, HOGonzalez, EJColwell, LFHabulihaz, BHe, HLeiting, BLyons, KAMarsilio, FPatel, RAWu, JKThornberry, NAWeber, AEParmee, ER Discovery of potent and selective beta-homophenylalanine based dipeptidyl peptidase IV inhibitors. Bioorg Med Chem Lett 14:4759-62 (2004)  
Target
Name:
Dipeptidyl peptidase 4
Synonyms:
ADABP Adenosine deaminase complexing protein 2 CD_antigen=CD26 DPP4 DPPIV Dipeptidyl peptidase 4 (DPP IV) Dipeptidyl peptidase 4 (DPP4) Dipeptidyl peptidase 4 membrane form Dipeptidyl peptidase IV Dipeptidyl peptidase IV (DDP-IV) Dipeptidyl peptidase IV membrane form Dipeptidyl peptidase-IV (DPP-4) T-cell activation antigen CD26 | TP103
Type:
Enzyme
Mol. Mass.:
88271.01
Organism:
Homo sapiens (Human)
Description:
P27487
Residue:
766
  
Inhibitor
Name:
BDBM50151803
Synonyms:
(R)-3-Amino-4-(2-fluoro-phenyl)-1-thiazolidin-3-yl-butan-1-one | CHEMBL187118
Type:
Small organic molecule
Emp. Form.:
C13H17FN2OS
Mol. Mass.:
268.35
SMILES:
N[C@@H](CC(=O)N1CCSC1)Cc1ccccc1F
: