Target
Sodium-dependent serotonin transporter
Ligand
BDBM50152003
Substrate
Meas. Tech.
ChEBML_306182
IC50
0.900000±n/a nM
Citation
 Heinrich, TBöttcher, HGericke, RBartoszyk, GDAnzali, SSeyfried, CAGreiner, HEVan Amsterdam, C Synthesis and structure--activity relationship in a class of indolebutylpiperazines as dual 5-HT(1A) receptor agonists and serotonin reuptake inhibitors. J Med Chem 47:4684-92 (2004)  
Target
Name:
Sodium-dependent serotonin transporter
Synonyms:
5-HT Transporter 5HT transporter Anandamid membrane transporter, AMT Monoamine transporters; Norepinephrine & serotonin Slc6a4 Sodium-dependent serotonin transporter (SERT) | imipramine receptor
Type:
Multi-pass membrane protein
Mol. Mass.:
70168.43
Organism:
Rattus norvegicus (rat)
Description:
P31652
Residue:
630
  
Inhibitor
Name:
BDBM50152003
Synonyms:
3-[4-(4-Chroman-6-yl-piperazin-1-yl)-butyl]-1H-indole-5-carbonitrile | CHEMBL188481
Type:
Small organic molecule
Emp. Form.:
C26H30N4O
Mol. Mass.:
414.5426
SMILES:
N#Cc1ccc2[nH]cc(CCCCN3CCN(CC3)c3ccc4OCCCc4c3)c2c1
: