Target
Estrogen receptor beta
Ligand
BDBM50152616
Substrate
Meas. Tech.
ChEMBL_305919 (CHEMBL832634)
IC50
0.5±n/a nM
Citation
 Collini, MDKaufman, DHManas, ESHarris, HAHenderson, RAXu, ZBUnwalla, RJMiller, CP 7-Substituted 2-phenyl-benzofurans as ER beta selective ligands. Bioorg Med Chem Lett 14:4925-9 (2004)  
Target
Name:
Estrogen receptor beta
Synonyms:
ER-beta ESR2_HUMAN Estradiol receptor beta (ERβ) Estrogen receptor (ER beta) Estrogen receptor beta (ER beta) NR3A2 estrogen beta
Type:
Protein
Mol. Mass.:
59238.43
Organism:
Homo sapiens (Human)
Description:
Q92731
Residue:
530
  
Inhibitor
Name:
BDBM50152616
Synonyms:
4-Bromo-2-(4-hydroxy-phenyl)-7-methoxy-benzofuran-5-ol | CHEMBL433944
Type:
Small organic molecule
Emp. Form.:
C15H11BrO4
Mol. Mass.:
335.149
SMILES:
COc1cc(O)c(Br)c2cc(oc12)-c1ccc(O)cc1
: