Target
Fatty acid-binding protein, heart
Ligand
BDBM50152856
Substrate
Meas. Tech.
ChEMBL_306095 (CHEMBL830870)
IC50
5700±n/a nM
Citation
 Lehmann, FHaile, SAxen, EMedina, CUppenberg, JSvensson, SLundbäck, TRondahl, LBarf, T Discovery of inhibitors of human adipocyte fatty acid-binding protein, a potential type 2 diabetes target. Bioorg Med Chem Lett 14:4445-8 (2004)  
Target
Name:
Fatty acid-binding protein, heart
Synonyms:
FABP11 FABPH_HUMAN MDGI
Type:
PROTEIN
Mol. Mass.:
14858.36
Organism:
Homo sapiens (Human)
Description:
ChEMBL_1463784
Residue:
133
  
Inhibitor
Name:
BDBM50152856
Synonyms:
3-Carbazol-9-yl-propionic acid | CHEMBL184817
Type:
Small organic molecule
Emp. Form.:
C15H13NO2
Mol. Mass.:
239.2692
SMILES:
OC(=O)CCn1c2ccccc2c2ccccc12
: