Target
Fatty acid-binding protein, adipocyte
Ligand
BDBM50152885
Substrate
Meas. Tech.
ChEMBL_305926 (CHEMBL833473)
IC50
33000±n/a nM
Citation
 Ringom, RAxen, EUppenberg, JLundbäck, TRondahl, LBarf, T Substituted benzylamino-6-(trifluoromethyl)pyrimidin-4(1H)-ones: a novel class of selective human A-FABP inhibitors. Bioorg Med Chem Lett 14:4449-52 (2004)  
Target
Name:
Fatty acid-binding protein, adipocyte
Synonyms:
A-FABP ALBP FABP4 Fatty acid binding protein adipocyte Fatty acid-binding protein 4 (FABP4)
Type:
Enzyme
Mol. Mass.:
14719.23
Organism:
Homo sapiens (Human)
Description:
P15090
Residue:
132
  
Inhibitor
Name:
BDBM50152885
Synonyms:
2-Benzylamino-6-trifluoromethyl-pyrimidin-4-ol | CHEMBL365655
Type:
Small organic molecule
Emp. Form.:
C12H10F3N3O
Mol. Mass.:
269.2225
SMILES:
FC(F)(F)c1cc(=O)[nH]c(NCc2ccccc2)n1
: