Target
Disintegrin and metalloproteinase domain-containing protein 17
Ligand
BDBM50152928
Substrate
Meas. Tech.
ChEMBL_305667 (CHEMBL827936)
IC50
<1±n/a nM
Citation
 Xue, CBChen, XTHe, XRoderick, JCorbett, RLGhavimi, BLiu, RQCovington, MBQian, MRibadeneira, MDVaddi, KTrzaskos, JNewton, RCDuan, JJDecicco, CP Synthesis and structure-activity relationship of a novel sulfone series of TNF-alpha converting enzyme inhibitors. Bioorg Med Chem Lett 14:4453-9 (2004)  
Target
Name:
Disintegrin and metalloproteinase domain-containing protein 17
Synonyms:
A disintegrin and metalloproteinase domain 17 ADAM 17 Snake venom-like protease TNF-alpha-Converting Enzyme
Type:
Metalloprotease
Mol. Mass.:
12197.99
Organism:
Sus scrofa (pig)
Description:
Partially purified TACE was obtained from porcine spleen.
Residue:
112
  
Inhibitor
Name:
BDBM50152928
Synonyms:
CHEMBL365905 | N-Hydroxy-2-{1-[4-(2-methyl-quinolin-4-ylmethoxy)-benzenesulfonylmethyl]-cyclohexyl}-acetamide
Type:
Small organic molecule
Emp. Form.:
C26H30N2O5S
Mol. Mass.:
482.592
SMILES:
Cc1cc(COc2ccc(cc2)S(=O)(=O)CC2(CC(=O)NO)CCCCC2)c2ccccc2n1
: