Target
Matrix metalloproteinase-9
Ligand
BDBM50152915
Substrate
Meas. Tech.
ChEMBL_302676 (CHEMBL839439)
Ki
>2100±n/a nM
Citation
 Xue, CBChen, XTHe, XRoderick, JCorbett, RLGhavimi, BLiu, RQCovington, MBQian, MRibadeneira, MDVaddi, KTrzaskos, JNewton, RCDuan, JJDecicco, CP Synthesis and structure-activity relationship of a novel sulfone series of TNF-alpha converting enzyme inhibitors. Bioorg Med Chem Lett 14:4453-9 (2004)  
Target
Name:
Matrix metalloproteinase-9
Synonyms:
67 kDa matrix metalloproteinase-9 92 kDa gelatinase CLG4B Gelatinase B MMP9 Matrix metalloproteinase 9 (MMP-9) Matrix metalloproteinase-9 (MMP9)
Type:
Enzyme
Mol. Mass.:
78452.28
Organism:
Homo sapiens (Human)
Description:
P14780
Residue:
707
  
Inhibitor
Name:
BDBM50152915
Synonyms:
CHEMBL185321 | N-Hydroxy-2-{2-[4-(2-methyl-quinolin-4-ylmethoxy)-benzenesulfonylmethyl]-piperidin-2-yl}-acetamide
Type:
Small organic molecule
Emp. Form.:
C25H29N3O5S
Mol. Mass.:
483.58
SMILES:
Cc1cc(COc2ccc(cc2)S(=O)(=O)CC2(CC(=O)NO)CCCCN2)c2ccccc2n1
: