Target
DNA polymerase alpha catalytic subunit
Ligand
BDBM20192
Substrate
Meas. Tech.
ChEMBL_306234 (CHEMBL830331)
IC50
>500000±n/a nM
Citation
 Oshige, MKuramochi, KOhta, KOgawa, AKuriyama, HSugawara, FKobayashi, SSakaguchi, K Molecular design of cholesterols as inhibitors of DNA polymerase alpha. J Med Chem 47:4971-4 (2004)  
Target
Name:
DNA polymerase alpha catalytic subunit
Synonyms:
DNA polymerase (alpha/delta/epsilon) DPOLA_HUMAN POLA1
Type:
PROTEIN
Mol. Mass.:
165895.25
Organism:
Homo sapiens (Human)
Description:
ChEMBL_1365493
Residue:
1462
  
Inhibitor
Name:
BDBM20192
Synonyms:
(1S,2R,5S,10S,11S,14R,15R)-2,15-dimethyl-14-[(2R)-6-methylheptan-2-yl]tetracyclo[8.7.0.0^{2,7}.0^{11,15}]heptadec-7-en-5-ol | cholesterol
Type:
Steroid
Emp. Form.:
C27H46O
Mol. Mass.:
386.6535
SMILES:
[H][C@@]1(CC[C@@]2([H])[C@]3([H])CC=C4C[C@@H](O)CC[C@]4(C)[C@@]3([H])CC[C@]12C)[C@H](C)CCCC(C)C
: