Target
Dipeptidyl peptidase 4
Ligand
BDBM50153406
Substrate
Meas. Tech.
ChEMBL_305312 (CHEMBL831703)
IC50
0.300000±n/a nM
Citation
 Edmondson, SDMastracchio, ABeconi, MColwell, LFHabulihaz, BHe, HKumar, SLeiting, BLyons, KAMao, AMarsilio, FPatel, RAWu, JKZhu, LThornberry, NAWeber, AEParmee, ER Potent and selective proline derived dipeptidyl peptidase IV inhibitors. Bioorg Med Chem Lett 14:5151-5 (2004)  
Target
Name:
Dipeptidyl peptidase 4
Synonyms:
ADABP Adenosine deaminase complexing protein 2 CD_antigen=CD26 DPP4 DPPIV Dipeptidyl peptidase 4 (DPP IV) Dipeptidyl peptidase 4 (DPP4) Dipeptidyl peptidase 4 membrane form Dipeptidyl peptidase IV Dipeptidyl peptidase IV (DDP-IV) Dipeptidyl peptidase IV membrane form Dipeptidyl peptidase-IV (DPP-4) T-cell activation antigen CD26 | TP103
Type:
Enzyme
Mol. Mass.:
88271.01
Organism:
Homo sapiens (Human)
Description:
P27487
Residue:
766
  
Inhibitor
Name:
BDBM50153406
Synonyms:
CHEMBL366290 | Trifluoro-acetate3-{(R)-4-[4-((S)-1-carboxy-2-methyl-propoxy)-benzylcarbamoyl]-thiazolidin-3-yl}-1-(2,5-difluoro-benzyl)-3-oxo-propyl-ammonium;
Type:
Small organic molecule
Emp. Form.:
C26H32F2N3O5S
Mol. Mass.:
536.611
SMILES:
CC(C)[C@H](Oc1ccc(CNC(=O)[C@@H]2CSCN2C(=O)CC([NH3+])Cc2cc(F)ccc2F)cc1)C(O)=O
: