Target
Caspase-9
Ligand
BDBM50153668
Substrate
Meas. Tech.
ChEBML_304799
IC50
9±n/a nM
Citation
 Cai, SXGuan, LJia, SWang, YYang, WTseng, BDrewe, J Dipeptidyl aspartyl fluoromethylketones as potent caspase inhibitors: SAR of the N-protecting group. Bioorg Med Chem Lett 14:5295-300 (2004)  
Target
Name:
Caspase-9
Synonyms:
Apoptotic protease-activating factor 1/Caspase-3/Caspase-9/Cytochrome c CASP-9 CASP9_HUMAN ICE-like apoptotic protease 6 caspase-9 isoform alpha preproprotein
Type:
Enzyme
Mol. Mass.:
46277.29
Organism:
Homo sapiens (Human)
Description:
Residue:
416
  
Inhibitor
Name:
BDBM50153668
Synonyms:
3-[(S)-2-(2,4-Dichloro-benzyloxycarbonylamino)-3-methyl-butyrylamino]-5-fluoro-4-oxo-pentanoic acid | CHEMBL185356
Type:
Small organic molecule
Emp. Form.:
C18H21Cl2FN2O6
Mol. Mass.:
451.274
SMILES:
CC(C)[C@H](NC(=O)OCc1ccc(Cl)cc1Cl)C(=O)NC(CC(O)=O)C(=O)CF
: