Target
Caspase-8
Ligand
BDBM50153668
Substrate
Meas. Tech.
ChEBML_304798
IC50
6±n/a nM
Citation
 Cai, SXGuan, LJia, SWang, YYang, WTseng, BDrewe, J Dipeptidyl aspartyl fluoromethylketones as potent caspase inhibitors: SAR of the N-protecting group. Bioorg Med Chem Lett 14:5295-300 (2004)  
Target
Name:
Caspase-8
Synonyms:
Apoptotic cysteine protease CAP4 CASP8 Caspase Caspase-8 subunit p18 FADD-like ICE ICE-like apoptotic protease 5 MCH5 | MORT1-associated CED-3 homolog
Type:
Enzyme
Mol. Mass.:
55373.89
Organism:
Homo sapiens (Human)
Description:
Q14790
Residue:
479
  
Inhibitor
Name:
BDBM50153668
Synonyms:
3-[(S)-2-(2,4-Dichloro-benzyloxycarbonylamino)-3-methyl-butyrylamino]-5-fluoro-4-oxo-pentanoic acid | CHEMBL185356
Type:
Small organic molecule
Emp. Form.:
C18H21Cl2FN2O6
Mol. Mass.:
451.274
SMILES:
CC(C)[C@H](NC(=O)OCc1ccc(Cl)cc1Cl)C(=O)NC(CC(O)=O)C(=O)CF
: