Target
Mitogen-activated protein kinase 14
Ligand
BDBM50153835
Substrate
Meas. Tech.
ChEMBL_305841 (CHEMBL829582)
IC50
180±n/a nM
Citation
 Brown, DSBelfield, AJBrown, GRCampbell, DFoubister, AMasters, DJPike, KGSnelson, WLWells, SL A novel series of p38 MAP kinase inhibitors for the potential treatment of rheumatoid arthritis. Bioorg Med Chem Lett 14:5383-7 (2004)  
Target
Name:
Mitogen-activated protein kinase 14
Synonyms:
CSAID-binding protein CSBP1 CSPB1 MAP kinase 14 MAP kinase p38 alpha MAPK14 MK14_HUMAN Mitogen-activated protein kinase p38 alpha Stress-activated protein kinase 2a | p38 MAP kinase alpha/beta
Type:
Serine/threonine-protein kinase
Mol. Mass.:
41286.76
Organism:
Homo sapiens (Human)
Description:
Q16539
Residue:
360
  
Inhibitor
Name:
BDBM50153835
Synonyms:
1-(3-dimethylaminophenylcarboxamido)-3-(4-hydroxyphenylcarboxamido)-4-methylbenzene CHEMBL186526 ZM-336372
Type:
Small organic molecule
Emp. Form.:
C23H23N3O3
Mol. Mass.:
389.447
SMILES:
CN(C)c1cccc(c1)C(=O)Nc1ccc(C)c(NC(=O)c2ccc(O)cc2)c1
: