Target
Prostaglandin G/H synthase 1
Ligand
BDBM50153982
Substrate
Meas. Tech.
ChEMBL_305401 (CHEMBL833051)
IC50
>84200±n/a nM
Citation
 Beswick, PBingham, SBountra, CBrown, TBrowning, KCampbell, IChessell, IClayton, NCollins, SCorfield, JGuntrip, SHaslam, CLambeth, PLucas, FMathews, NMurkit, GNaylor, APegg, NPickup, EPlayer, HPrice, HStevens, AStratton, SWiseman, J Identification of 2,3-diaryl-pyrazolo[1,5-b]pyridazines as potent and selective cyclooxygenase-2 inhibitors. Bioorg Med Chem Lett 14:5445-8 (2004)  
Target
Name:
Prostaglandin G/H synthase 1
Synonyms:
COX-1 Cyclooxygenase Cyclooxygenase-1 (COX-1) PTGS1 | Prostaglandin G/H synthase (cyclooxygenase)
Type:
Enzyme
Mol. Mass.:
68692.62
Organism:
Homo sapiens (Human)
Description:
P23219
Residue:
599
  
Inhibitor
Name:
BDBM50153982
Synonyms:
2-(4-Ethoxy-phenyl)-3-(4-methanesulfonyl-phenyl)-pyrazolo[1,5-b]pyridazine | CHEMBL364804
Type:
Small organic molecule
Emp. Form.:
C21H19N3O3S
Mol. Mass.:
393.459
SMILES:
CCOc1ccc(cc1)-c1nn2ncccc2c1-c1ccc(cc1)S(C)(=O)=O
: