Target
Delta-type opioid receptor
Ligand
BDBM50154034
Substrate
Meas. Tech.
ChEMBL_302811 (CHEMBL839501)
Ki
>100±n/a nM
Citation
 Breslin, HJMiskowski, TARafferty, BMCoutinho, SVPalmer, JMWallace, NHSchneider, CRKimball, ESZhang, SPLi, JColburn, RWStone, DJMartinez, RPHe, W Rationale, design, and synthesis of novel phenyl imidazoles as opioid receptor agonists for gastrointestinal disorders. J Med Chem 47:5009-20 (2004)  
Target
Name:
Delta-type opioid receptor
Synonyms:
Cytochrome P450 3A4 Delta opioid receptor Delta-type opioid receptor (DOR) OPRD_RAT Opioid receptor Opioid receptors; mu & delta Ror-a | Voltage-gated potassium channel
Type:
G Protein-Coupled Receptor (GPCR)
Mol. Mass.:
40465.04
Organism:
Rattus norvegicus (rat)
Description:
Competition binding assays were using CHO-K1 cell membranes expressing the opioid receptor.
Residue:
372
  
Inhibitor
Name:
BDBM50154034
Synonyms:
2-Amino-3-(4-hydroxy-phenyl)-1-[3-(5-methyl-4-propyl-1H-imidazol-2-yl)-3,4-dihydro-1H-isoquinolin-2-yl]-propan-1-one | CHEMBL440380
Type:
Small organic molecule
Emp. Form.:
C25H30N4O2
Mol. Mass.:
418.5313
SMILES:
CCCc1nc([nH]c1C)[C@@H]1Cc2ccccc2CN1C(=O)[C@@H](N)Cc1ccc(O)cc1
: