Target
Estrogen receptor beta
Ligand
BDBM50154053
Substrate
Meas. Tech.
ChEMBL_306448 (CHEMBL829092)
IC50
9.5±n/a nM
Citation
 Malamas, MSManas, ESMcDevitt, REGunawan, IXu, ZBCollini, MDMiller, CPDinh, THenderson, RAKeith, JCHarris, HA Design and synthesis of aryl diphenolic azoles as potent and selective estrogen receptor-beta ligands. J Med Chem 47:5021-40 (2004)  
Target
Name:
Estrogen receptor beta
Synonyms:
ER-beta Esr2 Estrb Estrogen receptor beta Nuclear receptor subfamily 3 group A member 2
Type:
PROTEIN
Mol. Mass.:
59091.81
Organism:
Mus musculus
Description:
ChEMBL_306448
Residue:
530
  
Inhibitor
Name:
BDBM50154053
Synonyms:
2-(4-Hydroxy-phenyl)-benzooxazol-6-ol CHEMBL187673
Type:
Small organic molecule
Emp. Form.:
C13H9NO3
Mol. Mass.:
227.2155
SMILES:
Oc1ccc(cc1)-c1nc2ccc(O)cc2o1
: