Target
Estrogen receptor beta
Ligand
BDBM50154057
Substrate
Meas. Tech.
ChEMBL_306408 (CHEMBL828749)
IC50
2.2±n/a nM
Citation
 Malamas, MSManas, ESMcDevitt, REGunawan, IXu, ZBCollini, MDMiller, CPDinh, THenderson, RAKeith, JCHarris, HA Design and synthesis of aryl diphenolic azoles as potent and selective estrogen receptor-beta ligands. J Med Chem 47:5021-40 (2004)  
Target
Name:
Estrogen receptor beta
Synonyms:
ESR2_RAT Esr2 Estrogen receptor beta | Nr3a2
Type:
PROTEIN
Mol. Mass.:
59173.80
Organism:
Rattus norvegicus
Description:
ChEMBL_803011
Residue:
530
  
Inhibitor
Name:
BDBM50154057
Synonyms:
2-(4-Hydroxy-phenyl)-benzooxazol-5-ol CHEMBL187392
Type:
Small organic molecule
Emp. Form.:
C13H9NO3
Mol. Mass.:
227.2155
SMILES:
Oc1ccc(cc1)-c1nc2cc(O)ccc2o1
: