Target
Estrogen receptor beta
Ligand
BDBM50154078
Substrate
Meas. Tech.
ChEMBL_306447 (CHEMBL829091)
IC50
1.4±n/a nM
Citation
 Malamas, MSManas, ESMcDevitt, REGunawan, IXu, ZBCollini, MDMiller, CPDinh, THenderson, RAKeith, JCHarris, HA Design and synthesis of aryl diphenolic azoles as potent and selective estrogen receptor-beta ligands. J Med Chem 47:5021-40 (2004)  
Target
Name:
Estrogen receptor beta
Synonyms:
ER-beta ESR2_HUMAN Estradiol receptor beta (ERβ) Estrogen receptor (ER beta) Estrogen receptor beta (ER beta) NR3A2 estrogen beta
Type:
Protein
Mol. Mass.:
59238.43
Organism:
Homo sapiens (Human)
Description:
Q92731
Residue:
530
  
Inhibitor
Name:
BDBM50154078
Synonyms:
7-Bromo-2-(4-hydroxy-2-methyl-phenyl)-benzooxazol-5-ol CHEMBL187311
Type:
Small organic molecule
Emp. Form.:
C14H10BrNO3
Mol. Mass.:
320.138
SMILES:
Cc1cc(O)ccc1-c1nc2cc(O)cc(Br)c2o1
: