Target
Estrogen receptor beta
Ligand
BDBM50154135
Substrate
Meas. Tech.
ChEMBL_306447 (CHEMBL829091)
IC50
3±n/a nM
Citation
 Malamas, MSManas, ESMcDevitt, REGunawan, IXu, ZBCollini, MDMiller, CPDinh, THenderson, RAKeith, JCHarris, HA Design and synthesis of aryl diphenolic azoles as potent and selective estrogen receptor-beta ligands. J Med Chem 47:5021-40 (2004)  
Target
Name:
Estrogen receptor beta
Synonyms:
ER-beta ESR2_HUMAN Estradiol receptor beta (ERβ) Estrogen receptor (ER beta) Estrogen receptor beta (ER beta) NR3A2 estrogen beta
Type:
Protein
Mol. Mass.:
59238.43
Organism:
Homo sapiens (Human)
Description:
Q92731
Residue:
530
  
Inhibitor
Name:
BDBM50154135
Synonyms:
2-(6-Hydroxy-naphthalen-1-yl)-benzooxazol-6-ol CHEMBL189077
Type:
Small organic molecule
Emp. Form.:
C17H11NO3
Mol. Mass.:
277.2741
SMILES:
Oc1ccc2nc(oc2c1)-c1cccc2cc(O)ccc12
: