Target
Estrogen receptor beta
Ligand
BDBM50154066
Substrate
Meas. Tech.
ChEMBL_306447 (CHEMBL829091)
IC50
3±n/a nM
Citation
 Malamas, MSManas, ESMcDevitt, REGunawan, IXu, ZBCollini, MDMiller, CPDinh, THenderson, RAKeith, JCHarris, HA Design and synthesis of aryl diphenolic azoles as potent and selective estrogen receptor-beta ligands. J Med Chem 47:5021-40 (2004)  
Target
Name:
Estrogen receptor beta
Synonyms:
ER-beta ESR2_HUMAN Estradiol receptor beta (ERβ) Estrogen receptor (ER beta) Estrogen receptor beta (ER beta) NR3A2 estrogen beta
Type:
Protein
Mol. Mass.:
59238.43
Organism:
Homo sapiens (Human)
Description:
Q92731
Residue:
530
  
Inhibitor
Name:
BDBM50154066
Synonyms:
4-(6-Hydroxy-benzooxazol-2-yl)-benzene-1,3-diol CHEMBL187087
Type:
Small organic molecule
Emp. Form.:
C13H9NO4
Mol. Mass.:
243.2149
SMILES:
Oc1ccc(-c2nc3ccc(O)cc3o2)c(O)c1
: